{"text_format":"3","workbook":"xlsx","n_sheets":4,"sheets":["部員名簿","部員名簿から引用（様式１）","直接入力（様式１）","様式２"],"not_rendered":{"defined_names":4},"read":"whole","date_system":"1900"}

{"sheet":"部員名簿","index":0,"n_rows":64,"n_cols":16,"rows_kept":64,"merged":[[2,1,3,1],[2,3,3,3],[2,4,3,4],[2,5,2,10],[2,11,3,11],[2,12,3,12],[2,13,3,13],[3,5,3,6],[3,7,3,8],[3,9,3,10]]}
[]
[{"$nulls":4},"高等学校　バスケットボール部"]
[null,"遠し\n番号","ﾕﾆﾌｫｰﾑ","氏　　　名","ふりがな","生（西暦）年月日",{"$nulls":5},"学年","身長\n(cm)","競技者登録番号"]
[null,null,"番号",null,null,"西暦年",null,"月",null,"日"]
[null,1,{"$nulls":4},"年",null,"月",null,"日",{"$nulls":4},"※従来の４番からの連番までの場合は"]
[null,2,{"$nulls":4},"年",null,"月",null,"日",{"$nulls":4},"　ユニフォーム番号の入力は必要ありません。"]
[null,3,{"$nulls":4},"年",null,"月",null,"日"]
[null,4,{"$nulls":4},"年",null,"月",null,"日",{"$nulls":4},"※ユニフォーム番号の欄は，０番，００番が"]
[null,5,{"$nulls":4},"年",null,"月",null,"日",{"$nulls":4},"　あるため，文字列表示になっています。"]
[null,6,{"$nulls":4},"年",null,"月",null,"日"]
[null,7,{"$nulls":4},"年",null,"月",null,"日",{"$nulls":4},"※氏名欄から右側は，今年度分からコピーで"]
[null,8,{"$nulls":4},"年",null,"月",null,"日",{"$nulls":4},"　構いません。"]
[null,9,{"$nulls":4},"年",null,"月",null,"日"]
[null,10,{"$nulls":4},"年",null,"月",null,"日"]
[null,11,{"$nulls":4},"年",null,"月",null,"日"]
[null,12,{"$nulls":4},"年",null,"月",null,"日"]
[null,13,{"$nulls":4},"年",null,"月",null,"日"]
[null,14,{"$nulls":4},"年",null,"月",null,"日"]
[null,15,{"$nulls":4},"年",null,"月",null,"日"]
[null,16,{"$nulls":4},"年",null,"月",null,"日"]
{"$rows_left_out":45}
{"sheet":"部員名簿から引用（様式１）","index":1,"n_rows":62,"n_cols":37,"rows_kept":62,"merged":[[1,3,4,27],[1,32,2,32],[1,33,2,36],[3,33,5,36],[4,32,5,32],[6,22,6,24],[6,25,6,27],[6,29,7,30],[7,4,8,20],[7,22,8,24],[7,25,8,27],[9,3,10,5],[9,6,10,15],[9,16,9,18],[9,19,9,25],[9,27,9,28],[9,29,9,30],[10,0,13,1],[10,16,10,18],[10,19,10,25],[10,27,10,28],[10,29,10,30],[11,3,11,5],[11,6,11,15],[11,16,11,18],[11,19,11,25],[11,27,11,28],[11,29,11,30],[11,34,11,35],[12,3,12,5],[12,6,12,15],[12,16,12,18],[12,19,12,25],[12,26,12,30],[12,34,12,35],[13,3,14,3],[13,4,14,9],[13,10,13,11],[13,12,14,13],[13,14,14,16],[13,17,14,23],[13,24,13,30],[14,10,14,11],[14,24,14,30],[15,1,16,1],[15,3,16,3],[15,4,16,9],[15,10,16,11],[15,12,16,13],[15,14,16,16],[15,17,16,18],[15,19,16,19],[15,20,16,20],[15,21,16,21],[15,22,16,22],[15,23,16,23],[15,24,15,30],[16,24,16,30],[17,1,18,1],[17,3,18,3],[17,4,18,9],[17,10,18,11],[17,12,18,13],[17,14,18,16],[17,17,18,18],[17,19,18,19],[17,20,18,20],[17,21,18,21],[17,22,18,22],[17,23,18,23],[17,24,17,30],[18,24,18,30],[19,1,20,1],[19,3,20,3],[19,4,20,9],[19,10,20,11],[19,12,20,13],[19,14,20,16],[19,17,20,18],[19,19,20,19],[19,20,20,20],[19,21,20,21],[19,22,20,22],[19,23,20,23],[19,24,19,30],[19,34,19,36],[20,24,20,30],[21,1,22,1],[21,3,22,3],[21,4,22,9],[21,10,22,11],[21,12,22,13],[21,14,22,16],[21,17,22,18],[21,19,22,19],[21,20,22,20],[21,21,22,21],[21,22,22,22],[21,23,22,23],[21,24,21,30],[21,33,25,36],[22,24,22,30],[23,1,24,1],[23,3,24,3],[23,4,24,9],[23,10,24,11],[23,12,24,13],[23,14,24,16],[23,17,24,18],[23,19,24,19],[23,20,24,20],[23,21,24,21],[23,22,24,22],[23,23,24,23],[23,24,23,30],[24,24,24,30],[25,1,26,1],[25,3,26,3],[25,4,26,9],[25,10,26,11],[25,12,26,13],[25,14,26,16],[25,17,26,18],[25,19,26,19],[25,20,26,20],[25,21,26,21],[25,22,26,22],[25,23,26,23],[25,24,25,30],[26,24,26,30],[27,1,28,1],[27,3,28,3],[27,4,28,9],[27,10,28,11],[27,12,28,13],[27,14,28,16],[27,17,28,18],[27,19,28,19],[27,20,28,20],[27,21,28,21],[27,22,28,22],[27,23,28,23],[27,24,27,30],[28,24,28,30],[29,1,30,1],[29,3,30,3],[29,4,30,9],[29,10,30,11],[29,12,30,13],[29,14,30,16],[29,17,30,18],[29,19,30,19],[29,20,30,20],[29,21,30,21],[29,22,30,22],[29,23,30,23],[29,24,29,30],[30,24,30,30],[31,1,32,1],[31,3,32,3],[31,4,32,9],[31,10,32,11],[31,12,32,13],[31,14,32,16],[31,17,32,18],[31,19,32,19],[31,20,32,20],[31,21,32,21],[31,22,32,22],[31,23,32,23],[31,24,31,30],[32,24,32,30],[33,1,34,1],[33,3,34,3],[33,4,34,9],[33,10,34,11],[33,12,34,13],[33,14,34,16],[33,17,34,18],[33,19,34,19],[33,20,34,20],[33,21,34,21],[33,22,34,22],[33,23,34,23],[33,24,33,30],[34,24,34,30],[35,1,36,1],[35,3,36,3],[35,4,36,9],[35,10,36,11],[35,12,36,13],[35,14,36,16],[35,17,36,18],[35,19,36,19],[35,20,36,20],[35,21,36,21],[35,22,36,22],[35,23,36,23],[35,24,35,30],[36,24,36,30],[37,1,38,1],[37,3,38,3],[37,4,38,9],[37,10,38,11],[37,12,38,13],[37,14,38,16],[37,17,38,18],[37,19,38,19],[37,20,38,20],[37,21,38,21],[37,22,38,22],[37,23,38,23],[37,24,37,30],[38,24,38,30],[39,1,40,1],[39,3,40,3],[39,4,40,9],[39,10,40,11],[39,12,40,13],[39,14,40,16],[39,17,40,18],[39,19,40,19],[39,20,40,20],[39,21,40,21],[39,22,40,22],[39,23,40,23],[39,24,39,30],[40,24,40,30],[41,1,42,1],[41,3,42,3],[41,4,42,9],[41,10,42,11],[41,12,42,13],[41,14,42,16],[41,17,42,18],[41,19,42,19],[41,20,42,20],[41,21,42,21],[41,22,42,22],[41,23,42,23],[41,24,41,30],[42,24,42,30],[43,1,44,1],[43,3,44,3],[43,4,44,9],[43,10,44,11],[43,12,44,13],[43,14,44,16],[43,17,44,18],[43,19,44,19],[43,20,44,20],[43,21,44,21],[43,22,44,22],[43,23,44,23],[43,24,43,30],[44,24,44,30],[45,1,46,1],[45,3,46,3],[45,4,46,9],[45,10,46,11],[45,12,46,13],[45,14,46,16],[45,17,46,18],[45,19,46,19],[45,20,46,20],[45,21,46,21],[45,22,46,22],[45,23,46,23],[45,24,45,30],[46,24,46,30],[47,1,48,1],[47,3,48,3],[47,4,48,9],[47,10,48,11],[47,12,48,13],[47,14,48,16],[47,17,48,18],[47,19,48,19],[47,20,48,20],[47,21,48,21],[47,22,48,22],[47,23,48,23],[47,24,47,30],[48,24,48,30],[49,1,50,1],[49,3,50,3],[49,4,50,9],[49,10,50,11],[49,12,50,13],[49,14,50,16],[49,17,50,18],[49,19,50,19],[49,20,50,20],[49,21,50,21],[49,22,50,22],[49,23,50,23],[49,24,49,30],[50,24,50,30],[51,1,52,1],[51,3,52,3],[51,4,52,9],[51,10,52,11],[51,12,52,13],[51,14,52,16],[51,17,52,18],[51,19,52,19],[51,20,52,20],[51,21,52,21],[51,22,52,22],[51,23,52,23],[51,24,51,30],[52,24,52,30],[53,1,54,1],[53,3,54,3],[53,4,54,9],[53,10,54,11],[53,12,54,13],[53,14,54,16],[53,17,54,18],[53,19,54,19],[53,20,54,20],[53,21,54,21],[53,22,54,22],[53,23,54,23],[53,24,53,30],[54,24,54,30],[55,3,56,30],[57,4,57,6],[58,10,58,16],[58,17,58,20],[58,21,58,27]]}
[]
[{"$nulls":3},"記入について，主将は①の欄にご記入ください。",{"$nulls":29}," ← 男子は「１」，女子は「２」を入力してください。"]
[]
[{"$nulls":33}," ← 空欄の場合は従来の４番からの連番を表示します。部員名簿の\n  　ユニフォーム番号を表示する場合は「１」を入力ください。"]
[]
[]
[{"$nulls":3},{"$f":"AK12&AG12&AK13","v":"令和8年度"},{"$nulls":5},{"$f":"VLOOKUP(AG13,AH14:AK19,3,1)","v":"長崎県高等学校バスケットボール"},{"$nulls":12},"男　子",null,null,"女　子",{"$nulls":3},"女子\nは切→\nり取る",null,null,"【 入力（記入）について 】"]
[{"$nulls":4},{"$f":"VLOOKUP(AG13,AH14:AK19,4,1)","v":"春季選手権大会　参加申込書"},{"$nulls":17},{"$f":"IF(AG2=1,\"○\",\"\")","v":""},null,null,{"$f":"IF(AG2=2,\"○\",\"\")","v":""},{"$nulls":6},"　○ コーチまたはＡコーチが外部指導者の場合は，外の欄に○印を入力ください。"]
[{"$nulls":32},"　○ コーチまたはＡコーチの資格の欄は，コーチ資格，Ａ，Ｂ，Ｃ，Ｄ，Ｅ，の"]
[{"$nulls":3},"学 校 名",{"$nulls":15},"氏　　　名",{"$nulls":6},"外","資格",null,"責任者",null,null,"　　いずれかを入力ください。お持ちでない場合は，「無」と入力ください。"]
["該当す\nる選手\nの名簿\nの左の\n番号を\n入力く\nださい",{"$nulls":15},"コーチ",{"$nulls":15}," ○ 責任者の欄は，引率責任者（当該学校の教職員）の方の欄に○印を入力ください。"]
[{"$nulls":3},"電 話 番 号",{"$nulls":12},"Ａコーチ",{"$nulls":15},8,"←","年度を入力ください",null,"令和"]
[{"$nulls":3},"所 在 地",{"$nulls":12},"マネージャー",{"$nulls":15},1,"←","大会番号を入力ください。",null,"年度"]
[{"$nulls":4},"選　手　氏　名",{"$nulls":5},"ﾕﾆﾌｫｰﾑ",null,"学年",null,"身　長",null,null,"生年月日（西暦）",{"$nulls":6},"氏名（ふりがな）",{"$nulls":8},1,"春季戦","長崎県高等学校バスケットボール","春季選手権大会　参加申込書"]
[null,"↓",{"$nulls":8},"番号",{"$nulls":13},"競技者登録番号",{"$nulls":8},2,"ｳｲﾝﾀｰ","全国高等学校バスケットボール","選手権大会県予選参加申込書"]
[{"$nulls":3},"①",{"$f":"IF(B16=\"\",\"\",VLOOKUP(B16,部員名簿!$B$5:$N$64,3,1))","v":""},{"$nulls":5},{"$f":"IF($AG$5=1,IF(B16=\"\",\"\",VLOOKUP(B16,部員名簿!$B$5:$N$64,2,1)),\"４\")","v":"４"},{"$f":"IF($B$16=\"\",\"\",VLOOKUP($B$16,部員名簿!$B$5:$N$64,2,1))","v":""},{"$f":"IF(B16=\"\",\"\",VLOOKUP(B16,部員名簿!$B$5:$N$64,11,1))","v":""},{"$f":"IF($B$16=\"\",\"\",VLOOKUP($B$16,部員名簿!$B$5:$N$64,2,1))","v":""},{"$f":"IF(B16=\"\",\"\",VLOOKUP(B16,部員名簿!$B$5:$N$64,12,1))","v":""},{"$f":"IF($B$16=\"\",\"\",VLOOKUP($B$16,部員名簿!$B$5:$N$64,2,1))","v":""},{"$f":"IF($B$16=\"\",\"\",VLOOKUP($B$16,部員名簿!$B$5:$N$64,2,1))","v":""},{"$f":"IF(B16=\"\",\"\",VLOOKUP(B16,部員名簿!$B$5:$N$64,5,1))","v":""},null,"年",{"$f":"IF(B16=\"\",\"\",VLOOKUP(B16,部員名簿!$B$5:$N$64,7,1))","v":""},"月",{"$f":"IF(B16=\"\",\"\",VLOOKUP(B16,部員名簿!$B$5:$N$64,9,1))","v":""},"日",{"$f":"IF(B16=\"\",\"\",VLOOKUP(B16,部員名簿!$B$5:$N$64,4,1))","v":""},{"$f":"IF($B$16=\"\",\"\",VLOOKUP($B$16,部員名簿!$B$5:$N$64,2,1))","v":""},{"$f":"IF($B$16=\"\",\"\",VLOOKUP($B$16,部員名簿!$B$5:$N$64,2,1))","v":""},{"$f":"IF($B$16=\"\",\"\",VLOOKUP($B$16,部員名簿!$B$5:$N$64,2,1))","v":""},{"$f":"IF($B$16=\"\",\"\",VLOOKUP($B$16,部員名簿!$B$5:$N$64,2,1))","v":""},{"$f":"IF($B$16=\"\",\"\",VLOOKUP($B$16,部員名簿!$B$5:$N$64,2,1))","v":""},{"$f":"IF($B$16=\"\",\"\",VLOOKUP($B$16,部員名簿!$B$5:$N$64,2,1))","v":""},null,null,3,"地区新","長崎地区高等学校","バスケットボール新人体育大会　参加申込書"]
[{"$nulls":24},{"$f":"IF(B16=\"\",\"\",VLOOKUP(B16,部員名簿!$B$5:$N$64,13,1))","v":""},{"$f":"IF($B$16=\"\",\"\",VLOOKUP($B$16,部員名簿!$B$5:$N$64,2,1))","v":""},{"$f":"IF($B$16=\"\",\"\",VLOOKUP($B$16,部員名簿!$B$5:$N$64,2,1))","v":""},{"$f":"IF($B$16=\"\",\"\",VLOOKUP($B$16,部員名簿!$B$5:$N$64,2,1))","v":""},{"$f":"IF($B$16=\"\",\"\",VLOOKUP($B$16,部員名簿!$B$5:$N$64,2,1))","v":""},{"$f":"IF($B$16=\"\",\"\",VLOOKUP($B$16,部員名簿!$B$5:$N$64,2,1))","v":""},{"$f":"IF($B$16=\"\",\"\",VLOOKUP($B$16,部員名簿!$B$5:$N$64,2,1))","v":""},null,null,4,"〃","中地区高等学校","バスケットボール新人体育大会　参加申込書"]
[{"$nulls":3},"②",{"$f":"IF(B18=\"\",\"\",VLOOKUP(B18,部員名簿!$B$5:$N$64,3,1))","v":""},{"$nulls":5},{"$f":"IF($AG$5=1,IF(B18=\"\",\"\",VLOOKUP(B18,部員名簿!$B$5:$N$64,2,1)),\"５\")","v":"５"},{"$f":"IF($B$16=\"\",\"\",VLOOKUP($B$16,部員名簿!$B$5:$N$64,2,1))","v":""},{"$f":"IF(B18=\"\",\"\",VLOOKUP(B18,部員名簿!$B$5:$N$64,11,1))","v":""},{"$f":"IF($B$16=\"\",\"\",VLOOKUP($B$16,部員名簿!$B$5:$N$64,2,1))","v":""},{"$f":"IF(B18=\"\",\"\",VLOOKUP(B18,部員名簿!$B$5:$N$64,12,1))","v":""},{"$f":"IF($B$16=\"\",\"\",VLOOKUP($B$16,部員名簿!$B$5:$N$64,2,1))","v":""},{"$f":"IF($B$16=\"\",\"\",VLOOKUP($B$16,部員名簿!$B$5:$N$64,2,1))","v":""},{"$f":"IF(B18=\"\",\"\",VLOOKUP(B18,部員名簿!$B$5:$N$64,5,1))","v":""},null,"年",{"$f":"IF(B18=\"\",\"\",VLOOKUP(B18,部員名簿!$B$5:$N$64,7,1))","v":""},"月",{"$f":"IF(B18=\"\",\"\",VLOOKUP(B18,部員名簿!$B$5:$N$64,9,1))","v":""},"日",{"$f":"IF(B18=\"\",\"\",VLOOKUP(B18,部員名簿!$B$5:$N$64,4,1))","v":""},{"$f":"IF($B$16=\"\",\"\",VLOOKUP($B$16,部員名簿!$B$5:$N$64,2,1))","v":""},{"$f":"IF($B$16=\"\",\"\",VLOOKUP($B$16,部員名簿!$B$5:$N$64,2,1))","v":""},{"$f":"IF($B$16=\"\",\"\",VLOOKUP($B$16,部員名簿!$B$5:$N$64,2,1))","v":""},{"$f":"IF($B$16=\"\",\"\",VLOOKUP($B$16,部員名簿!$B$5:$N$64,2,1))","v":""},{"$f":"IF($B$16=\"\",\"\",VLOOKUP($B$16,部員名簿!$B$5:$N$64,2,1))","v":""},{"$f":"IF($B$16=\"\",\"\",VLOOKUP($B$16,部員名簿!$B$5:$N$64,2,1))","v":""},null,null,5,"〃","佐世保地区高等学校","バスケットボール新人体育大会　参加申込書"]
[{"$nulls":24},{"$f":"IF(B18=\"\",\"\",VLOOKUP(B18,部員名簿!$B$5:$N$64,13,1))","v":""},{"$f":"IF($B$16=\"\",\"\",VLOOKUP($B$16,部員名簿!$B$5:$N$64,2,1))","v":""},{"$f":"IF($B$16=\"\",\"\",VLOOKUP($B$16,部員名簿!$B$5:$N$64,2,1))","v":""},{"$f":"IF($B$16=\"\",\"\",VLOOKUP($B$16,部員名簿!$B$5:$N$64,2,1))","v":""},{"$f":"IF($B$16=\"\",\"\",VLOOKUP($B$16,部員名簿!$B$5:$N$64,2,1))","v":""},{"$f":"IF($B$16=\"\",\"\",VLOOKUP($B$16,部員名簿!$B$5:$N$64,2,1))","v":""},{"$f":"IF($B$16=\"\",\"\",VLOOKUP($B$16,部員名簿!$B$5:$N$64,2,1))","v":""},null,null,6,"ローカル"]
[{"$nulls":3},"③",{"$f":"IF(B20=\"\",\"\",VLOOKUP(B20,部員名簿!$B$5:$N$64,3,1))","v":""},{"$nulls":5},{"$f":"IF($AG$5=1,IF(B20=\"\",\"\",VLOOKUP(B20,部員名簿!$B$5:$N$64,2,1)),\"６\")","v":"６"},{"$f":"IF($B$16=\"\",\"\",VLOOKUP($B$16,部員名簿!$B$5:$N$64,2,1))","v":""},{"$f":"IF(B20=\"\",\"\",VLOOKUP(B20,部員名簿!$B$5:$N$64,11,1))","v":""},{"$f":"IF($B$16=\"\",\"\",VLOOKUP($B$16,部員名簿!$B$5:$N$64,2,1))","v":""},{"$f":"IF(B20=\"\",\"\",VLOOKUP(B20,部員名簿!$B$5:$N$64,12,1))","v":""},{"$f":"IF($B$16=\"\",\"\",VLOOKUP($B$16,部員名簿!$B$5:$N$64,2,1))","v":""},{"$f":"IF($B$16=\"\",\"\",VLOOKUP($B$16,部員名簿!$B$5:$N$64,2,1))","v":""},{"$f":"IF(B20=\"\",\"\",VLOOKUP(B20,部員名簿!$B$5:$N$64,5,1))","v":""},null,"年",{"$f":"IF(B20=\"\",\"\",VLOOKUP(B20,部員名簿!$B$5:$N$64,7,1))","v":""},"月",{"$f":"IF(B20=\"\",\"\",VLOOKUP(B20,部員名簿!$B$5:$N$64,9,1))","v":""},"日",{"$f":"IF(B20=\"\",\"\",VLOOKUP(B20,部員名簿!$B$5:$N$64,4,1))","v":""},{"$f":"IF($B$16=\"\",\"\",VLOOKUP($B$16,部員名簿!$B$5:$N$64,2,1))","v":""},{"$f":"IF($B$16=\"\",\"\",VLOOKUP($B$16,部員名簿!$B$5:$N$64,2,1))","v":""},{"$f":"IF($B$16=\"\",\"\",VLOOKUP($B$16,部員名簿!$B$5:$N$64,2,1))","v":""},{"$f":"IF($B$16=\"\",\"\",VLOOKUP($B$16,部員名簿!$B$5:$N$64,2,1))","v":""},{"$f":"IF($B$16=\"\",\"\",VLOOKUP($B$16,部員名簿!$B$5:$N$64,2,1))","v":""},{"$f":"IF($B$16=\"\",\"\",VLOOKUP($B$16,部員名簿!$B$5:$N$64,2,1))","v":""},{"$nulls":3},"※6番目の欄は，ご自由に大会名を入力して，ご利用可能です。"]
{"$rows_left_out":43}
{"sheet":"直接入力（様式１）","index":2,"n_rows":62,"n_cols":36,"rows_kept":62,"merged":[[1,2,2,26],[4,21,4,23],[4,24,4,26],[4,28,5,29],[5,3,6,19],[5,21,6,23],[5,24,6,26],[7,2,8,4],[7,5,8,14],[7,15,7,17],[7,18,7,24],[7,26,7,27],[7,28,7,29],[8,15,8,17],[8,18,8,24],[8,26,8,27],[8,28,8,29],[9,2,9,4],[9,5,9,14],[9,15,9,17],[9,18,9,24],[9,26,9,27],[9,28,9,29],[9,33,9,34],[10,2,10,4],[10,5,10,14],[10,15,10,17],[10,18,10,24],[10,25,10,29],[10,33,10,34],[11,2,12,2],[11,3,12,8],[11,9,11,10],[11,11,12,12],[11,13,12,15],[11,16,12,22],[11,23,11,29],[12,9,12,10],[12,23,12,29],[13,2,14,2],[13,3,14,8],[13,9,14,10],[13,11,14,12],[13,13,14,15],[13,16,14,17],[13,18,14,18],[13,19,14,19],[13,20,14,20],[13,21,14,21],[13,22,14,22],[13,23,13,29],[14,23,14,29],[15,2,16,2],[15,3,16,8],[15,9,16,10],[15,11,16,12],[15,13,16,15],[15,16,16,17],[15,18,16,18],[15,19,16,19],[15,20,16,20],[15,21,16,21],[15,22,16,22],[15,23,15,29],[16,23,16,29],[17,2,18,2],[17,3,18,8],[17,9,18,10],[17,11,18,12],[17,13,18,15],[17,16,18,17],[17,18,18,18],[17,19,18,19],[17,20,18,20],[17,21,18,21],[17,22,18,22],[17,23,17,29],[18,23,18,29],[19,2,20,2],[19,3,20,8],[19,9,20,10],[19,11,20,12],[19,13,20,15],[19,16,20,17],[19,18,20,18],[19,19,20,19],[19,20,20,20],[19,21,20,21],[19,22,20,22],[19,23,19,29],[19,32,21,35],[20,23,20,29],[21,2,22,2],[21,3,22,8],[21,9,22,10],[21,11,22,12],[21,13,22,15],[21,16,22,17],[21,18,22,18],[21,19,22,19],[21,20,22,20],[21,21,22,21],[21,22,22,22],[21,23,21,29],[22,23,22,29],[23,2,24,2],[23,3,24,8],[23,9,24,10],[23,11,24,12],[23,13,24,15],[23,16,24,17],[23,18,24,18],[23,19,24,19],[23,20,24,20],[23,21,24,21],[23,22,24,22],[23,23,23,29],[24,23,24,29],[25,2,26,2],[25,3,26,8],[25,9,26,10],[25,11,26,12],[25,13,26,15],[25,16,26,17],[25,18,26,18],[25,19,26,19],[25,20,26,20],[25,21,26,21],[25,22,26,22],[25,23,25,29],[26,23,26,29],[27,2,28,2],[27,3,28,8],[27,9,28,10],[27,11,28,12],[27,13,28,15],[27,16,28,17],[27,18,28,18],[27,19,28,19],[27,20,28,20],[27,21,28,21],[27,22,28,22],[27,23,27,29],[28,23,28,29],[29,2,30,2],[29,3,30,8],[29,9,30,10],[29,11,30,12],[29,13,30,15],[29,16,30,17],[29,18,30,18],[29,19,30,19],[29,20,30,20],[29,21,30,21],[29,22,30,22],[29,23,29,29],[30,23,30,29],[31,2,32,2],[31,3,32,8],[31,9,32,10],[31,11,32,12],[31,13,32,15],[31,16,32,17],[31,18,32,18],[31,19,32,19],[31,20,32,20],[31,21,32,21],[31,22,32,22],[31,23,31,29],[32,23,32,29],[33,2,34,2],[33,3,34,8],[33,9,34,10],[33,11,34,12],[33,13,34,15],[33,16,34,17],[33,18,34,18],[33,19,34,19],[33,20,34,20],[33,21,34,21],[33,22,34,22],[33,23,33,29],[34,23,34,29],[35,2,36,2],[35,3,36,8],[35,9,36,10],[35,11,36,12],[35,13,36,15],[35,16,36,17],[35,18,36,18],[35,19,36,19],[35,20,36,20],[35,21,36,21],[35,22,36,22],[35,23,35,29],[36,23,36,29],[37,2,38,2],[37,3,38,8],[37,9,38,10],[37,11,38,12],[37,13,38,15],[37,16,38,17],[37,18,38,18],[37,19,38,19],[37,20,38,20],[37,21,38,21],[37,22,38,22],[37,23,37,29],[38,23,38,29],[39,2,40,2],[39,3,40,8],[39,9,40,10],[39,11,40,12],[39,13,40,15],[39,16,40,17],[39,18,40,18],[39,19,40,19],[39,20,40,20],[39,21,40,21],[39,22,40,22],[39,23,39,29],[40,23,40,29],[41,2,42,2],[41,3,42,8],[41,9,42,10],[41,11,42,12],[41,13,42,15],[41,16,42,17],[41,18,42,18],[41,19,42,19],[41,20,42,20],[41,21,42,21],[41,22,42,22],[41,23,41,29],[42,23,42,29],[43,2,44,2],[43,3,44,8],[43,9,44,10],[43,11,44,12],[43,13,44,15],[43,16,44,17],[43,18,44,18],[43,19,44,19],[43,20,44,20],[43,21,44,21],[43,22,44,22],[43,23,43,29],[44,23,44,29],[45,2,46,2],[45,3,46,8],[45,9,46,10],[45,11,46,12],[45,13,46,15],[45,16,46,17],[45,18,46,18],[45,19,46,19],[45,20,46,20],[45,21,46,21],[45,22,46,22],[45,23,45,29],[46,23,46,29],[47,2,48,2],[47,3,48,8],[47,9,48,10],[47,11,48,12],[47,13,48,15],[47,16,48,17],[47,18,48,18],[47,19,48,19],[47,20,48,20],[47,21,48,21],[47,22,48,22],[47,23,47,29],[48,23,48,29],[49,2,50,2],[49,3,50,8],[49,9,50,10],[49,11,50,12],[49,13,50,15],[49,16,50,17],[49,18,50,18],[49,19,50,19],[49,20,50,20],[49,21,50,21],[49,22,50,22],[49,23,49,29],[50,23,50,29],[51,2,52,2],[51,3,52,8],[51,9,52,10],[51,11,52,12],[51,13,52,15],[51,16,52,17],[51,18,52,18],[51,19,52,19],[51,20,52,20],[51,21,52,21],[51,22,52,22],[51,23,51,29],[52,23,52,29],[53,2,54,29],[55,3,55,5],[56,9,56,15],[56,16,56,19],[56,20,56,26]]}
[]
[null,null,"記入について，主将は①の欄にご記入ください。"]
[]
[]
[null,null,{"$f":"AJ10&AF10&AJ11","v":"令和8年度"},{"$nulls":5},{"$f":"VLOOKUP(AF11,AG12:AJ17,3,1)","v":"長崎県高等学校バスケットボール"},{"$nulls":12},"男　子",null,null,"女　子",{"$nulls":3},"女子\nは切→\nり取る",null,null,"【 入力（記入）について 】"]
[{"$nulls":3},{"$f":"VLOOKUP(AF11,AG12:AJ17,4,1)","v":"春季選手権大会　参加申込書"},{"$nulls":27},"　○ コーチまたはＡコーチが外部指導者の場合は，外の欄に○印を入力ください。"]
[{"$nulls":31},"　○ コーチまたはＡコーチの資格の欄は，コーチ資格，Ａ，Ｂ，Ｃ，Ｄ，Ｅ，の"]
[null,null,"学 校 名",null,null,"　　",{"$nulls":12},"氏　　　名",{"$nulls":6},"外","資格",null,"責任者",null,null,"　　いずれかを入力ください。お持ちでない場合は，「無」と入力ください。"]
[{"$nulls":15},"コーチ",null,null,"　　",{"$nulls":12}," ○ 責任者の欄は，引率責任者（当該学校の教職員）の方の欄に○印を入力ください。"]
[null,null,"電 話 番 号",{"$nulls":12},"Ａコーチ",null,null,"　　",{"$nulls":12},8,"←","年度を入力ください",null,"令和"]
[null,null,"所 在 地",{"$nulls":12},"マネージャー",{"$nulls":15},1,"←","大会番号を入力ください。",null,"年度"]
[{"$nulls":3},"選　手　氏　名",{"$nulls":5},"ﾕﾆﾌｫｰﾑ",null,"学年",null,"身　長",null,null,"生年月日（西暦）",{"$nulls":6},"氏名（ふりがな）",{"$nulls":8},1,"春季戦","長崎県高等学校バスケットボール","春季選手権大会　参加申込書"]
[{"$nulls":9},"番号",{"$nulls":13},"競技者登録番号",{"$nulls":8},2,"ｳｲﾝﾀｰ","全国高等学校バスケットボール","選手権大会県予選参加申込書"]
[null,null,"①","　",{"$nulls":5},"　",{"$nulls":8},"年",null,"月",null,"日",{"$nulls":9},3,"地区新","長崎地区高等学校","バスケットボール新人体育大会　参加申込書"]
[{"$nulls":32},4,"〃","中地区高等学校","バスケットボール新人体育大会　参加申込書"]
[null,null,"②","　",{"$nulls":5},"　",{"$nulls":8},"年",null,"月",null,"日",{"$nulls":9},5,"〃","佐世保地区高等学校","バスケットボール新人体育大会　参加申込書"]
[{"$nulls":32},6,"ローカル"]
[null,null,"③","　",{"$nulls":5},"　",{"$nulls":8},"年",null,"月",null,"日",{"$nulls":10},"※6番目の欄は，ご自由に大会名を入力して，ご利用可能です。"]
[]
[null,null,"④","　",{"$nulls":5},"　",{"$nulls":8},"年",null,"月",null,"日",{"$nulls":9},"氏名，生年月日（西暦），学年，身長，ふりがな，競技者登録番号\n\nの全てを，直接ご入力ください。"]
{"$rows_left_out":43}
{"sheet":"様式２","index":3,"n_rows":52,"n_cols":21,"rows_kept":52,"merged":[[3,17,4,20],[7,3,8,19],[9,3,10,19],[15,3,16,6],[15,7,17,19],[17,3,18,6],[20,9,22,11],[20,15,22,17],[24,9,25,17],[28,3,32,19],[38,3,39,18],[41,3,41,4],[43,2,44,8],[43,9,44,12],[43,13,44,19],[46,9,47,12],[46,13,47,19]]}
[]
[]
[]
[{"$nulls":17},"女子は切り取る→"]
[]
[]
[]
[{"$nulls":3},"令和８年度長崎県高等学校バスケットボール"]
[]
[{"$nulls":3},"春季選手権大会参加申込書"]
[]
[]
[]
[]
[]
[{"$nulls":3},"学校名"]
[]
[{"$nulls":3},"（チーム名）"]
[]
[]
{"$rows_left_out":24}